view tests/make_test.out @ 445:a71176d858be

surge protection: specialcase AttachFile, fix no cache exists case imported from: moin--main--1.5--patch-449
author Thomas Waldmann <tw@waldmann-edv.de>
date Thu, 16 Feb 2006 22:08:06 +0000
parents 2bdb90aa1005
children 45cd2bbb395b
line wrap: on
line source
removing old wiki ...
copying data ...
untaring underlay ...
testComment01 (MoinMoin._tests.test_converter_text_html_text_x_moin.ConvertBlockRepeatableTests) ... FAIL
testComment02 (MoinMoin._tests.test_converter_text_html_text_x_moin.ConvertBlockRepeatableTests) ... FAIL
testHeading01 (MoinMoin._tests.test_converter_text_html_text_x_moin.ConvertBlockRepeatableTests) ... FAIL
testHeading02 (MoinMoin._tests.test_converter_text_html_text_x_moin.ConvertBlockRepeatableTests) ... FAIL
testListSuccess01 (MoinMoin._tests.test_converter_text_html_text_x_moin.ConvertBlockRepeatableTests) ... FAIL
testListSuccess02 (MoinMoin._tests.test_converter_text_html_text_x_moin.ConvertBlockRepeatableTests) ... FAIL
testListSuccess03 (MoinMoin._tests.test_converter_text_html_text_x_moin.ConvertBlockRepeatableTests) ... FAIL
testListSuccess04 (MoinMoin._tests.test_converter_text_html_text_x_moin.ConvertBlockRepeatableTests) ... FAIL
testListSuccess05 (MoinMoin._tests.test_converter_text_html_text_x_moin.ConvertBlockRepeatableTests) ... FAIL
testListSuccess06 (MoinMoin._tests.test_converter_text_html_text_x_moin.ConvertBlockRepeatableTests) ... FAIL
testListSuccess07 (MoinMoin._tests.test_converter_text_html_text_x_moin.ConvertBlockRepeatableTests) ... FAIL
testListSuccess08 (MoinMoin._tests.test_converter_text_html_text_x_moin.ConvertBlockRepeatableTests) ... FAIL
testListSuccess09 (MoinMoin._tests.test_converter_text_html_text_x_moin.ConvertBlockRepeatableTests) ... FAIL
testListSuccess10 (MoinMoin._tests.test_converter_text_html_text_x_moin.ConvertBlockRepeatableTests) ... FAIL
testListSuccess11 (MoinMoin._tests.test_converter_text_html_text_x_moin.ConvertBlockRepeatableTests) ... FAIL
testListSuccess12 (MoinMoin._tests.test_converter_text_html_text_x_moin.ConvertBlockRepeatableTests) ... FAIL
testListSuccess13 (MoinMoin._tests.test_converter_text_html_text_x_moin.ConvertBlockRepeatableTests) ... FAIL
testListSuccess14 (MoinMoin._tests.test_converter_text_html_text_x_moin.ConvertBlockRepeatableTests) ... FAIL
testListSuccess15 (MoinMoin._tests.test_converter_text_html_text_x_moin.ConvertBlockRepeatableTests) ... FAIL
testListSuccess16 (MoinMoin._tests.test_converter_text_html_text_x_moin.ConvertBlockRepeatableTests) ... FAIL
testListSuccess17 (MoinMoin._tests.test_converter_text_html_text_x_moin.ConvertBlockRepeatableTests) ... FAIL
testListSuccess18 (MoinMoin._tests.test_converter_text_html_text_x_moin.ConvertBlockRepeatableTests) ... FAIL
testListSuccess19 (MoinMoin._tests.test_converter_text_html_text_x_moin.ConvertBlockRepeatableTests) ... FAIL
testListSuccess20 (MoinMoin._tests.test_converter_text_html_text_x_moin.ConvertBlockRepeatableTests) ... FAIL
testListSuccess21 (MoinMoin._tests.test_converter_text_html_text_x_moin.ConvertBlockRepeatableTests) ... FAIL
testListSuccess23 (MoinMoin._tests.test_converter_text_html_text_x_moin.ConvertBlockRepeatableTests) ... FAIL
testListSuccess26 (MoinMoin._tests.test_converter_text_html_text_x_moin.ConvertBlockRepeatableTests) ... FAIL
testListSuccess28 (MoinMoin._tests.test_converter_text_html_text_x_moin.ConvertBlockRepeatableTests) ... FAIL
testListSuccess29 (MoinMoin._tests.test_converter_text_html_text_x_moin.ConvertBlockRepeatableTests) ... FAIL
testListSuccess30 (MoinMoin._tests.test_converter_text_html_text_x_moin.ConvertBlockRepeatableTests) ... FAIL
testParagraph1 (MoinMoin._tests.test_converter_text_html_text_x_moin.ConvertBlockRepeatableTests) ... FAIL
testParagraph2 (MoinMoin._tests.test_converter_text_html_text_x_moin.ConvertBlockRepeatableTests) ... FAIL
testPreSuccess1 (MoinMoin._tests.test_converter_text_html_text_x_moin.ConvertBlockRepeatableTests) ... FAIL
testPreSuccess2 (MoinMoin._tests.test_converter_text_html_text_x_moin.ConvertBlockRepeatableTests) ... FAIL
testPreSuccess3 (MoinMoin._tests.test_converter_text_html_text_x_moin.ConvertBlockRepeatableTests) ... FAIL
testPreSuccess4 (MoinMoin._tests.test_converter_text_html_text_x_moin.ConvertBlockRepeatableTests) ... FAIL
testPreSuccess5 (MoinMoin._tests.test_converter_text_html_text_x_moin.ConvertBlockRepeatableTests) ... FAIL
testPreSuccess6 (MoinMoin._tests.test_converter_text_html_text_x_moin.ConvertBlockRepeatableTests) ... FAIL
testPreSuccess7 (MoinMoin._tests.test_converter_text_html_text_x_moin.ConvertBlockRepeatableTests) ... FAIL
testPreSuccess8 (MoinMoin._tests.test_converter_text_html_text_x_moin.ConvertBlockRepeatableTests) ... FAIL
testPreSuccess9 (MoinMoin._tests.test_converter_text_html_text_x_moin.ConvertBlockRepeatableTests) ... FAIL
testRule1 (MoinMoin._tests.test_converter_text_html_text_x_moin.ConvertBlockRepeatableTests) ... FAIL
testTable01 (MoinMoin._tests.test_converter_text_html_text_x_moin.ConvertBlockRepeatableTests) ... FAIL
testTable02 (MoinMoin._tests.test_converter_text_html_text_x_moin.ConvertBlockRepeatableTests) ... FAIL
testTable03 (MoinMoin._tests.test_converter_text_html_text_x_moin.ConvertBlockRepeatableTests) ... FAIL
testTable04 (MoinMoin._tests.test_converter_text_html_text_x_moin.ConvertBlockRepeatableTests) ... FAIL
testTable05 (MoinMoin._tests.test_converter_text_html_text_x_moin.ConvertBlockRepeatableTests) ... FAIL
testTable06 (MoinMoin._tests.test_converter_text_html_text_x_moin.ConvertBlockRepeatableTests) ... FAIL
testList01 (MoinMoin._tests.test_converter_text_html_text_x_moin.ConvertBrokenBrowserTests) ... ok
testEmphasis01 (MoinMoin._tests.test_converter_text_html_text_x_moin.ConvertInlineFormatRepeatableTests) ... FAIL
testEmphasis02 (MoinMoin._tests.test_converter_text_html_text_x_moin.ConvertInlineFormatRepeatableTests) ... FAIL
testEmphasis03 (MoinMoin._tests.test_converter_text_html_text_x_moin.ConvertInlineFormatRepeatableTests) ... FAIL
testEmphasis04 (MoinMoin._tests.test_converter_text_html_text_x_moin.ConvertInlineFormatRepeatableTests) ... FAIL
testEmphasis05 (MoinMoin._tests.test_converter_text_html_text_x_moin.ConvertInlineFormatRepeatableTests) ... FAIL
testEmphasis06 (MoinMoin._tests.test_converter_text_html_text_x_moin.ConvertInlineFormatRepeatableTests) ... FAIL
testEmphasis07 (MoinMoin._tests.test_converter_text_html_text_x_moin.ConvertInlineFormatRepeatableTests) ... FAIL
testEmphasis08 (MoinMoin._tests.test_converter_text_html_text_x_moin.ConvertInlineFormatRepeatableTests) ... FAIL
testEmphasis09 (MoinMoin._tests.test_converter_text_html_text_x_moin.ConvertInlineFormatRepeatableTests) ... FAIL
testEmphasis10 (MoinMoin._tests.test_converter_text_html_text_x_moin.ConvertInlineFormatRepeatableTests) ... FAIL
testEmphasis11 (MoinMoin._tests.test_converter_text_html_text_x_moin.ConvertInlineFormatRepeatableTests) ... FAIL
testFormatBig01 (MoinMoin._tests.test_converter_text_html_text_x_moin.ConvertInlineFormatRepeatableTests) ... FAIL
testFormatSmall01 (MoinMoin._tests.test_converter_text_html_text_x_moin.ConvertInlineFormatRepeatableTests) ... FAIL
testFormatStrike01 (MoinMoin._tests.test_converter_text_html_text_x_moin.ConvertInlineFormatRepeatableTests) ... FAIL
testFormatSub01 (MoinMoin._tests.test_converter_text_html_text_x_moin.ConvertInlineFormatRepeatableTests) ... FAIL
testFormatSup01 (MoinMoin._tests.test_converter_text_html_text_x_moin.ConvertInlineFormatRepeatableTests) ... FAIL
testFormatUnderline01 (MoinMoin._tests.test_converter_text_html_text_x_moin.ConvertInlineFormatRepeatableTests) ... FAIL
testPre01 (MoinMoin._tests.test_converter_text_html_text_x_moin.ConvertInlineFormatRepeatableTests) ... FAIL
testWhitespace01 (MoinMoin._tests.test_converter_text_html_text_x_moin.ConvertInlineFormatRepeatableTests) ... FAIL
testNoWikiWord01 (MoinMoin._tests.test_converter_text_html_text_x_moin.ConvertInlineItemRepeatableTests) ... FAIL
testSmiley01 (MoinMoin._tests.test_converter_text_html_text_x_moin.ConvertInlineItemRepeatableTests) ... FAIL
testWikiWord01 (MoinMoin._tests.test_converter_text_html_text_x_moin.ConvertInlineItemRepeatableTests) ... FAIL
test1 (MoinMoin._tests.test_converter_text_html_text_x_moin.StripWhitespaceTests) ... ERROR
test2 (MoinMoin._tests.test_converter_text_html_text_x_moin.StripWhitespaceTests) ... ERROR
test3 (MoinMoin._tests.test_converter_text_html_text_x_moin.StripWhitespaceTests) ... ERROR
test4 (MoinMoin._tests.test_converter_text_html_text_x_moin.StripWhitespaceTests) ... ERROR
error: access error like a dict ... ok
error: create with encoded string ... ok
error: create with any object ... ok
error: create with unicode ... ok
testSyntaxReference (MoinMoin._tests.test_formatter.FormatterTestCase) ... Formatting using <class MoinMoin.formatter.dom_xml.Formatter at 0x55b782fc>
[('xml', {}), ('p', {'type': 'ol'}), ('ol', {'start': None, 'type': u'1'}), ('li', {})]
ERROR
testQuoting (MoinMoin._tests.test_packages.QuotingTestCase) ... ok
testBasicPackageThings (MoinMoin._tests.test_packages.UnsafePackageTestcase) ... ok
Page: page.exists() finds existing pages only ... ok
PageEditor: expand @USERNAME@ CamelCase ... ok
PageEditor: expand @USERNAME@ extended name - enabled ... ok
PageEditor: expand @MAILTO@ ... ok
PageEditor: expand user variables ... ok
PageEditor: expand general variables ... ok
parser.wiki: empty lines before block element ignored ... FAIL
parser.wiki: paragraph closed before block element ... FAIL
parser.wiki: close open inline tag when block close ... FAIL
parser.wiki: DateTime macro ... ok
parser.wiki: escape html markup in getText formatted call with link ... ok
parser.wiki: escape html markup in getText formatted call ... ok
parser.wiki: escape html markup in GetText macro ... ok
parser.wiki: escape html markup in getText non formatted call ... ok
parser.wiki: escape html markup in pre ... ok
parser.wiki: escape html markup in pre with hashbang ... ok
parser.wiki: escape html markup in python code area ... ok
parser.wiki: escape html markup in `tt` ... ok
parser.wiki: escape html markup in {{{tt}}} ... ok
parser.wiki: escape wiki table  markup in pre ... ok
parser.wiki: escape wiki table  markup in pre with hashbang ... ok
parser.wiki: escape wiki table markup in python code area ... ok
parser.wiki: escape wiki table markup in `tt` ... ok
parser.wiki: escape wiki table markup in {{{tt}}} ... ok
parser.wiki: ignore white space around heading text ... FAIL
parser.wiki: empty line separates paragraphs ... FAIL
parser.wiki: first paragraph should be in <p> ... FAIL
parser.wiki: create paragraph after block markup ... ok
parser.wiki: ------------ long rule shortened to hr6 ... FAIL
parser.wiki: --- is no rule ... ok
parser.wiki: ---- is standard rule ... FAIL
parser.wiki: ----- rules with size ... FAIL
parser.wiki: TOC links to headings with white space ... ok
parser.wiki: text formating ... ok
pysupport: import existing wiki plugin ... ok
pysupport: import name from existing module ... ok
pysupport: import nonexistent attritbue raises AttributeError ... ok
pysupport: import nonexistent module raises ImportError ... ok
pysupport: import nonexistent wiki plugin fail ... ok
repair_language: should replace known language ... ok
repair_language: return crlf line endings ... ok
repair_language: should not replace in page body ... ok
repair_language: should not replace unknown langauge ... ok
request: getPageNameFromQueryString: ascii ... ok
request: getPageNameFromQueryString: non ascii ... ok
request: getPageNameFromQueryString: under_score ... ok
request: normalize pagename: restrict groups to alpha numeric Unicode ... ok
request: httpDate default rfc1123 ... ok
request: httpDate rfc850 ... ok
request: normalize pagename: normalize slashes ... ok
request: normalize pagename: normalize whitespace ... ok
request: normalize pagename: remove invalid unicode chars ... ok
request: normalize pagename: underscore convert to spaces and normalized ... ok
search: quoting bug - unquoted terms ... ok
search: quoting bug - quoted terms ... ok
user: encode ascii password ... ok
user: encode unicode password ... ok
user: isValidName: reject group names ... ok
user: isValidName: reject unicode non alpha numeric characters ... ok
user: isValidName: accept names in any language, with spaces ... ok
user: isValidName: reject leading, trailing or multiple whitespace ... ok
user: login with ascii password ... ok
user: login with non-ascii password in pre 1.3 user file ... ok
user: login replace old non-ascii password in pre 1.3 user file ... ok
user: login with non-ascii password ... ok
util.lock: ExclusiveLock: acquire ... ok
util.lock: ExclusiveLock: acquire after timeout ... ok
util.lock: ExclusiveLock: lock is exclusive ... ok
util.lock: ExclusiveLock: exists ... ok
util.lock: ExclusiveLock: expire ... ok
util.lock: ExclusiveLock: isExpired ... ok
util.lock: ExclusiveLock: isLocked ... ok
util.lock: ExclusiveLock: release ... ok
util.lock: ExclusiveLock: raise ValueError for timeout < 2.0 ... ok
util.mail: encode address: 'Phrase <local@domain>' ... ok
util.mail: encode Uncode address: 'ויקי <local@domain>' ... ok
util.mail: encode address with empty address: 'Phrase <>' ... ok
util.mail: encode address with empty phrase: '<local@domain>' ... ok
util.mail: encode invalid address 'Phrase <blah' ... ok
util.mail: encode simple address: local@domain ... ok
util.mail: decoding spam safe mail ... ok
util.web: make query sting from argument ... ok
util.web: make query sting from argument and keywords ... ok
util.web: make query sting from keywords ... ok
util.web: creating html select with non existing selection ... FAIL
util.web: creating html select with selected item ... FAIL
widget.html: append to and extend composite element ... ok
widget.html: creating html widgets ... ok
widegt.html: invalid attributes raises exception ... ok
wikiacl: allow extra white space between entries ... ok
wikiacl: bad guy may not allowed anything ... ok
wikiacl: default meta acl ... ok
wikiacl: empty acl string raise StopIteration ... ok
wikiacl: empty names with rights ... ok
wikiacl: empty rights ... ok
wikiacl: ignore rights not in acl_rights_valid ... ok
wikiacl: ignore invalid acl ... ok
wikiacl: mixed wiki names and names with spaces ... ok
wikiacl: acl modifiers ... ok
wikiacl: multiple entries ... ok
wikiacl: multiple entries with spaces ... ok
wikiacl: multiple names with spaces ... ok
wikiacl: single name with spaces ... ok
wikiacl: single wiki name, single right ... ok
wikiacl: white space acl string raise StopIteration ... ok
wikiacl: applying acl by user name ... ok
wikidicts: create dict from keys and values in text ... ok
wikidict: names in SystemPagesGroup should be in request.dicts ... ok
wikidicts: initFromText: CamelCase links ... ok
wikidicts: initFromText: extended link ... ok
wikidicts: initFromText: extended names ... ok
wikidicts: initFromText: ignore anything but first level list itmes ... ok
wikidicts: initFromText: ignore non first level items ... ok
wikidicts: initFromText: strip whitespace around items ... ok
wikimacro: trivial macro works ... ok
wikiutil: good system page names accepted, bad rejected ... FAIL
wikiutil: good template names accepted, bad rejected ... ok
wikixml.marshal: create new marshal ... ok
wikixml.marshal: setting marshal property ... ok

======================================================================
ERROR: test1 (MoinMoin._tests.test_converter_text_html_text_x_moin.StripWhitespaceTests)
----------------------------------------------------------------------
Traceback (most recent call last):
  File "/srv/moin_tw/moin--main--1.5/MoinMoin/_tests/test_converter_text_html_text_x_moin.py", line 1081, in test1
    self.do(test, output)
  File "/srv/moin_tw/moin--main--1.5/MoinMoin/_tests/test_converter_text_html_text_x_moin.py", line 1074, in do
    super(StripWhitespaceTests, self).do(converter.strip_whitespace, text, output)
  File "/srv/moin_tw/moin--main--1.5/MoinMoin/_tests/test_converter_text_html_text_x_moin.py", line 1064, in do
    raise _tests.TestSkiped('xml.dom.ext module is not available')
TestSkipped: xml.dom.ext module is not available

======================================================================
ERROR: test2 (MoinMoin._tests.test_converter_text_html_text_x_moin.StripWhitespaceTests)
----------------------------------------------------------------------
Traceback (most recent call last):
  File "/srv/moin_tw/moin--main--1.5/MoinMoin/_tests/test_converter_text_html_text_x_moin.py", line 1090, in test2
    self.do(test, output)
  File "/srv/moin_tw/moin--main--1.5/MoinMoin/_tests/test_converter_text_html_text_x_moin.py", line 1074, in do
    super(StripWhitespaceTests, self).do(converter.strip_whitespace, text, output)
  File "/srv/moin_tw/moin--main--1.5/MoinMoin/_tests/test_converter_text_html_text_x_moin.py", line 1064, in do
    raise _tests.TestSkiped('xml.dom.ext module is not available')
TestSkipped: xml.dom.ext module is not available

======================================================================
ERROR: test3 (MoinMoin._tests.test_converter_text_html_text_x_moin.StripWhitespaceTests)
----------------------------------------------------------------------
Traceback (most recent call last):
  File "/srv/moin_tw/moin--main--1.5/MoinMoin/_tests/test_converter_text_html_text_x_moin.py", line 1104, in test3
    self.do(test, output)
  File "/srv/moin_tw/moin--main--1.5/MoinMoin/_tests/test_converter_text_html_text_x_moin.py", line 1074, in do
    super(StripWhitespaceTests, self).do(converter.strip_whitespace, text, output)
  File "/srv/moin_tw/moin--main--1.5/MoinMoin/_tests/test_converter_text_html_text_x_moin.py", line 1064, in do
    raise _tests.TestSkiped('xml.dom.ext module is not available')
TestSkipped: xml.dom.ext module is not available

======================================================================
ERROR: test4 (MoinMoin._tests.test_converter_text_html_text_x_moin.StripWhitespaceTests)
----------------------------------------------------------------------
Traceback (most recent call last):
  File "/srv/moin_tw/moin--main--1.5/MoinMoin/_tests/test_converter_text_html_text_x_moin.py", line 1109, in test4
    self.do(test, output)
  File "/srv/moin_tw/moin--main--1.5/MoinMoin/_tests/test_converter_text_html_text_x_moin.py", line 1074, in do
    super(StripWhitespaceTests, self).do(converter.strip_whitespace, text, output)
  File "/srv/moin_tw/moin--main--1.5/MoinMoin/_tests/test_converter_text_html_text_x_moin.py", line 1064, in do
    raise _tests.TestSkiped('xml.dom.ext module is not available')
TestSkipped: xml.dom.ext module is not available

======================================================================
ERROR: testSyntaxReference (MoinMoin._tests.test_formatter.FormatterTestCase)
----------------------------------------------------------------------
Traceback (most recent call last):
  File "/srv/moin_tw/moin--main--1.5/MoinMoin/_tests/test_formatter.py", line 31, in testSyntaxReference
    self.formatPage("SyntaxReference", formatter)
  File "/srv/moin_tw/moin--main--1.5/MoinMoin/_tests/test_formatter.py", line 45, in formatPage
    return self.request.redirectedOutput(page.send_page, self.request)
  File "/srv/moin_tw/moin--main--1.5/MoinMoin/request.py", line 682, in redirectedOutput
    function(*args, **kw)
  File "../../MoinMoin/Page.py", line 1227, in send_page
  File "../../MoinMoin/Page.py", line 1306, in send_page_content
  File "../../MoinMoin/Page.py", line 1323, in format
  File "/srv/moin_tw/moin--main--1.5/MoinMoin/parser/wiki.py", line 1061, in format
    self.request.write(self._indent_to(indlen, indtype, numtype, numstart))
  File "/srv/moin_tw/moin--main--1.5/MoinMoin/parser/wiki.py", line 571, in _indent_to
    close.append(self.formatter.paragraph(0))
  File "/srv/moin_tw/moin--main--1.5/MoinMoin/formatter/dom_xml.py", line 301, in paragraph
    return self._set_tag('p', on)
  File "/srv/moin_tw/moin--main--1.5/MoinMoin/formatter/dom_xml.py", line 159, in _set_tag
    raise ValueError, "<%s> expected <%s> given" % (last_tag, tag)
ValueError: <li> expected <p> given

======================================================================
FAIL: testComment01 (MoinMoin._tests.test_converter_text_html_text_x_moin.ConvertBlockRepeatableTests)
----------------------------------------------------------------------
Traceback (most recent call last):
  File "/srv/moin_tw/moin--main--1.5/MoinMoin/_tests/test_converter_text_html_text_x_moin.py", line 94, in testComment01
    self.do(test, output)
  File "/srv/moin_tw/moin--main--1.5/MoinMoin/_tests/test_converter_text_html_text_x_moin.py", line 85, in do
    self.failUnlessEqual(repeat, output)
  File "/usr/lib/python2.3/unittest.py", line 302, in failUnlessEqual
    raise self.failureException, \
AssertionError: u'<pre class="comment">##test</pre>' != u'<pre class="comment">\n##test</pre>'

======================================================================
FAIL: testComment02 (MoinMoin._tests.test_converter_text_html_text_x_moin.ConvertBlockRepeatableTests)
----------------------------------------------------------------------
Traceback (most recent call last):
  File "/srv/moin_tw/moin--main--1.5/MoinMoin/_tests/test_converter_text_html_text_x_moin.py", line 105, in testComment02
    self.do(test, output)
  File "/srv/moin_tw/moin--main--1.5/MoinMoin/_tests/test_converter_text_html_text_x_moin.py", line 85, in do
    self.failUnlessEqual(repeat, output)
  File "/usr/lib/python2.3/unittest.py", line 302, in failUnlessEqual
    raise self.failureException, \
AssertionError: u'<pre class="comment">##test</pre><pre class="comment">##test</pre>' != u'<pre class="comment">\n##test</pre>\n<pre class="comment">\n##test</pre>'

======================================================================
FAIL: testHeading01 (MoinMoin._tests.test_converter_text_html_text_x_moin.ConvertBlockRepeatableTests)
----------------------------------------------------------------------
Traceback (most recent call last):
  File "/srv/moin_tw/moin--main--1.5/MoinMoin/_tests/test_converter_text_html_text_x_moin.py", line 115, in testHeading01
    self.do(test, output)
  File "/srv/moin_tw/moin--main--1.5/MoinMoin/_tests/test_converter_text_html_text_x_moin.py", line 87, in do
    self.failUnlessEqual(text, out)
  File "/usr/lib/python2.3/unittest.py", line 302, in failUnlessEqual
    raise self.failureException, \
AssertionError: u'= test1 =\n\n' != u'= test1 =\n'

======================================================================
FAIL: testHeading02 (MoinMoin._tests.test_converter_text_html_text_x_moin.ConvertBlockRepeatableTests)
----------------------------------------------------------------------
Traceback (most recent call last):
  File "/srv/moin_tw/moin--main--1.5/MoinMoin/_tests/test_converter_text_html_text_x_moin.py", line 128, in testHeading02
    self.do(test, output)
  File "/srv/moin_tw/moin--main--1.5/MoinMoin/_tests/test_converter_text_html_text_x_moin.py", line 85, in do
    self.failUnlessEqual(repeat, output)
  File "/usr/lib/python2.3/unittest.py", line 302, in failUnlessEqual
    raise self.failureException, \
AssertionError: u'<h2>test1</h2><h3>test2</h3>' != u'<h2>test1</h2>\n<h3>test2</h3>'

======================================================================
FAIL: testListSuccess01 (MoinMoin._tests.test_converter_text_html_text_x_moin.ConvertBlockRepeatableTests)
----------------------------------------------------------------------
Traceback (most recent call last):
  File "/srv/moin_tw/moin--main--1.5/MoinMoin/_tests/test_converter_text_html_text_x_moin.py", line 141, in testListSuccess01
    self.do(test, output)
  File "/srv/moin_tw/moin--main--1.5/MoinMoin/_tests/test_converter_text_html_text_x_moin.py", line 85, in do
    self.failUnlessEqual(repeat, output)
  File "/usr/lib/python2.3/unittest.py", line 302, in failUnlessEqual
    raise self.failureException, \
AssertionError: u'<ul><li><p class="line886">test </p></li></ul>' != u'<ul>\n<li><p>test </p>\n</li>\n</ul>'

======================================================================
FAIL: testListSuccess02 (MoinMoin._tests.test_converter_text_html_text_x_moin.ConvertBlockRepeatableTests)
----------------------------------------------------------------------
Traceback (most recent call last):
  File "/srv/moin_tw/moin--main--1.5/MoinMoin/_tests/test_converter_text_html_text_x_moin.py", line 154, in testListSuccess02
    self.do(test, output)
  File "/srv/moin_tw/moin--main--1.5/MoinMoin/_tests/test_converter_text_html_text_x_moin.py", line 85, in do
    self.failUnlessEqual(repeat, output)
  File "/usr/lib/python2.3/unittest.py", line 302, in failUnlessEqual
    raise self.failureException, \
AssertionError: u'<ol type="1"><li><p class="line886">test </p></li></ol>' != u'<ol type="1">\n<li><p>test </p>\n</li>\n</ol>'

======================================================================
FAIL: testListSuccess03 (MoinMoin._tests.test_converter_text_html_text_x_moin.ConvertBlockRepeatableTests)
----------------------------------------------------------------------
Traceback (most recent call last):
  File "/srv/moin_tw/moin--main--1.5/MoinMoin/_tests/test_converter_text_html_text_x_moin.py", line 168, in testListSuccess03
    self.do(test, output)
  File "/srv/moin_tw/moin--main--1.5/MoinMoin/_tests/test_converter_text_html_text_x_moin.py", line 85, in do
    self.failUnlessEqual(repeat, output)
  File "/usr/lib/python2.3/unittest.py", line 302, in failUnlessEqual
    raise self.failureException, \
AssertionError: u'<dl><dt>test</dt><dd><p class="line886">test </p></dd></dl>' != u'<dl>\n<dt>test</dt>\n<dd><p>test </p>\n</dd>\n</dl>'

======================================================================
FAIL: testListSuccess04 (MoinMoin._tests.test_converter_text_html_text_x_moin.ConvertBlockRepeatableTests)
----------------------------------------------------------------------
Traceback (most recent call last):
  File "/srv/moin_tw/moin--main--1.5/MoinMoin/_tests/test_converter_text_html_text_x_moin.py", line 184, in testListSuccess04
    self.do(test, output)
  File "/srv/moin_tw/moin--main--1.5/MoinMoin/_tests/test_converter_text_html_text_x_moin.py", line 85, in do
    self.failUnlessEqual(repeat, output)
  File "/usr/lib/python2.3/unittest.py", line 302, in failUnlessEqual
    raise self.failureException, \
AssertionError: u'<ul><li><p class="line886">test </p></li><li><p class="line886">test </p></li></ul>' != u'<ul>\n<li><p>test </p>\n</li>\n<li><p>test </p>\n</li>\n</ul>'

======================================================================
FAIL: testListSuccess05 (MoinMoin._tests.test_converter_text_html_text_x_moin.ConvertBlockRepeatableTests)
----------------------------------------------------------------------
Traceback (most recent call last):
  File "/srv/moin_tw/moin--main--1.5/MoinMoin/_tests/test_converter_text_html_text_x_moin.py", line 200, in testListSuccess05
    self.do(test, output)
  File "/srv/moin_tw/moin--main--1.5/MoinMoin/_tests/test_converter_text_html_text_x_moin.py", line 85, in do
    self.failUnlessEqual(repeat, output)
  File "/usr/lib/python2.3/unittest.py", line 302, in failUnlessEqual
    raise self.failureException, \
AssertionError: u'<ol type="1"><li><p class="line886">test </p></li><li><p class="line886">test </p></li></ol>' != u'<ol type="1">\n<li><p>test </p>\n</li>\n<li><p>test </p>\n</li>\n</ol>'

======================================================================
FAIL: testListSuccess06 (MoinMoin._tests.test_converter_text_html_text_x_moin.ConvertBlockRepeatableTests)
----------------------------------------------------------------------
Traceback (most recent call last):
  File "/srv/moin_tw/moin--main--1.5/MoinMoin/_tests/test_converter_text_html_text_x_moin.py", line 218, in testListSuccess06
    self.do(test, output)
  File "/srv/moin_tw/moin--main--1.5/MoinMoin/_tests/test_converter_text_html_text_x_moin.py", line 85, in do
    self.failUnlessEqual(repeat, output)
  File "/usr/lib/python2.3/unittest.py", line 302, in failUnlessEqual
    raise self.failureException, \
AssertionError: u'<dl><dt>test</dt><dd><p class="line886">test </p></dd><dt>test</dt><dd><p class="line886">test </p></dd></dl>' != u'<dl>\n<dt>test</dt>\n<dd><p>test </p>\n</dd>\n<dt>test</dt>\n<dd><p>test </p>\n</dd>\n</dl>'

======================================================================
FAIL: testListSuccess07 (MoinMoin._tests.test_converter_text_html_text_x_moin.ConvertBlockRepeatableTests)
----------------------------------------------------------------------
Traceback (most recent call last):
  File "/srv/moin_tw/moin--main--1.5/MoinMoin/_tests/test_converter_text_html_text_x_moin.py", line 237, in testListSuccess07
    self.do(test, output)
  File "/srv/moin_tw/moin--main--1.5/MoinMoin/_tests/test_converter_text_html_text_x_moin.py", line 85, in do
    self.failUnlessEqual(repeat, output)
  File "/usr/lib/python2.3/unittest.py", line 302, in failUnlessEqual
    raise self.failureException, \
AssertionError: u'<ul><li><p class="line886">test </p></li><li class="gap"><p class="line886">test </p></li></ul>' != u'<ul>\n<li><p>test </p>\n</li>\n</ul>\n<ul>\n<li><p>test </p>\n</li>\n</ul>'

======================================================================
FAIL: testListSuccess08 (MoinMoin._tests.test_converter_text_html_text_x_moin.ConvertBlockRepeatableTests)
----------------------------------------------------------------------
Traceback (most recent call last):
  File "/srv/moin_tw/moin--main--1.5/MoinMoin/_tests/test_converter_text_html_text_x_moin.py", line 256, in testListSuccess08
    self.do(test, output)
  File "/srv/moin_tw/moin--main--1.5/MoinMoin/_tests/test_converter_text_html_text_x_moin.py", line 85, in do
    self.failUnlessEqual(repeat, output)
  File "/usr/lib/python2.3/unittest.py", line 302, in failUnlessEqual
    raise self.failureException, \
AssertionError: u'<ol type="1"><li><p class="line886">test </p></li><li class="gap"><p class="line886">test </p></li></ol>' != u'<ol type="1">\n<li><p>test </p>\n</li>\n</ol>\n<ol type="1">\n<li><p>test </p>\n</li>\n</ol>'

======================================================================
FAIL: testListSuccess09 (MoinMoin._tests.test_converter_text_html_text_x_moin.ConvertBlockRepeatableTests)
----------------------------------------------------------------------
Traceback (most recent call last):
  File "/srv/moin_tw/moin--main--1.5/MoinMoin/_tests/test_converter_text_html_text_x_moin.py", line 277, in testListSuccess09
    self.do(test, output)
  File "/srv/moin_tw/moin--main--1.5/MoinMoin/_tests/test_converter_text_html_text_x_moin.py", line 85, in do
    self.failUnlessEqual(repeat, output)
  File "/usr/lib/python2.3/unittest.py", line 302, in failUnlessEqual
    raise self.failureException, \
AssertionError: u'<dl><dt>test</dt><dd><p class="line886">test </p></dd><dt>test</dt><dd><p class="line886">test </p></dd></dl>' != u'<dl>\n<dt>test</dt>\n<dd><p>test </p>\n</dd>\n</dl>\n<dl>\n<dt>test</dt>\n<dd><p>test </p>\n</dd>\n</dl>'

======================================================================
FAIL: testListSuccess10 (MoinMoin._tests.test_converter_text_html_text_x_moin.ConvertBlockRepeatableTests)
----------------------------------------------------------------------
Traceback (most recent call last):
  File "/srv/moin_tw/moin--main--1.5/MoinMoin/_tests/test_converter_text_html_text_x_moin.py", line 295, in testListSuccess10
    self.do(test, output)
  File "/srv/moin_tw/moin--main--1.5/MoinMoin/_tests/test_converter_text_html_text_x_moin.py", line 85, in do
    self.failUnlessEqual(repeat, output)
  File "/usr/lib/python2.3/unittest.py", line 302, in failUnlessEqual
    raise self.failureException, \
AssertionError: u'<ul><li><p class="line886">test </p><ul><li><p class="line886">test </p></li></ul></ul>' != u'<ul>\n<li><p>test </p>\n<ul>\n<li><p>test </p>\n</li>\n</ul>\n</li>\n</ul>'

======================================================================
FAIL: testListSuccess11 (MoinMoin._tests.test_converter_text_html_text_x_moin.ConvertBlockRepeatableTests)
----------------------------------------------------------------------
Traceback (most recent call last):
  File "/srv/moin_tw/moin--main--1.5/MoinMoin/_tests/test_converter_text_html_text_x_moin.py", line 313, in testListSuccess11
    self.do(test, output)
  File "/srv/moin_tw/moin--main--1.5/MoinMoin/_tests/test_converter_text_html_text_x_moin.py", line 85, in do
    self.failUnlessEqual(repeat, output)
  File "/usr/lib/python2.3/unittest.py", line 302, in failUnlessEqual
    raise self.failureException, \
AssertionError: u'<ol type="1"><li><p class="line886">test </p><ol type="1"><li><p class="line886">test </p></li></ol></ol>' != u'<ol type="1">\n<li><p>test </p>\n<ol type="1">\n<li><p>test </p>\n</li>\n</ol>\n</li>\n</ol>'

======================================================================
FAIL: testListSuccess12 (MoinMoin._tests.test_converter_text_html_text_x_moin.ConvertBlockRepeatableTests)
----------------------------------------------------------------------
Traceback (most recent call last):
  File "/srv/moin_tw/moin--main--1.5/MoinMoin/_tests/test_converter_text_html_text_x_moin.py", line 333, in testListSuccess12
    self.do(test, output)
  File "/srv/moin_tw/moin--main--1.5/MoinMoin/_tests/test_converter_text_html_text_x_moin.py", line 85, in do
    self.failUnlessEqual(repeat, output)
  File "/usr/lib/python2.3/unittest.py", line 302, in failUnlessEqual
    raise self.failureException, \
AssertionError: u'<dl><dt>test</dt><dd><p class="line886">test </p><dl><dt>test</dt><dd><p class="line886">test </p></dd></dl></dl>' != u'<dl>\n<dt>test</dt>\n<dd><p>test </p>\n<dl>\n<dt>test</dt>\n<dd><p>test </p>\n</dd>\n</dl>\n</dd>\n</dl>'

======================================================================
FAIL: testListSuccess13 (MoinMoin._tests.test_converter_text_html_text_x_moin.ConvertBlockRepeatableTests)
----------------------------------------------------------------------
Traceback (most recent call last):
  File "/srv/moin_tw/moin--main--1.5/MoinMoin/_tests/test_converter_text_html_text_x_moin.py", line 354, in testListSuccess13
    self.do(test, output)
  File "/srv/moin_tw/moin--main--1.5/MoinMoin/_tests/test_converter_text_html_text_x_moin.py", line 85, in do
    self.failUnlessEqual(repeat, output)
  File "/usr/lib/python2.3/unittest.py", line 302, in failUnlessEqual
    raise self.failureException, \
AssertionError: u'<ul><li><p class="line886">test </p><ul><li><p class="line886">test </p></li></ul></li><li><p class="line886">test </p></li></ul>' != u'<ul>\n<li><p>test </p>\n<ul>\n<li><p>test </p>\n</li>\n</ul>\n</li>\n<li><p>test </p>\n</li>\n</ul>'

======================================================================
FAIL: testListSuccess14 (MoinMoin._tests.test_converter_text_html_text_x_moin.ConvertBlockRepeatableTests)
----------------------------------------------------------------------
Traceback (most recent call last):
  File "/srv/moin_tw/moin--main--1.5/MoinMoin/_tests/test_converter_text_html_text_x_moin.py", line 375, in testListSuccess14
    self.do(test, output)
  File "/srv/moin_tw/moin--main--1.5/MoinMoin/_tests/test_converter_text_html_text_x_moin.py", line 85, in do
    self.failUnlessEqual(repeat, output)
  File "/usr/lib/python2.3/unittest.py", line 302, in failUnlessEqual
    raise self.failureException, \
AssertionError: u'<ol type="1"><li><p class="line886">test </p><ol type="1"><li><p class="line886">test </p></li></ol></li><li><p class="line886">test </p></li></ol>' != u'<ol type="1">\n<li><p>test </p>\n<ol type="1">\n<li><p>test </p>\n</li>\n</ol>\n</li>\n<li><p>test </p>\n</li>\n</ol>'

======================================================================
FAIL: testListSuccess15 (MoinMoin._tests.test_converter_text_html_text_x_moin.ConvertBlockRepeatableTests)
----------------------------------------------------------------------
Traceback (most recent call last):
  File "/srv/moin_tw/moin--main--1.5/MoinMoin/_tests/test_converter_text_html_text_x_moin.py", line 399, in testListSuccess15
    self.do(test, output)
  File "/srv/moin_tw/moin--main--1.5/MoinMoin/_tests/test_converter_text_html_text_x_moin.py", line 85, in do
    self.failUnlessEqual(repeat, output)
  File "/usr/lib/python2.3/unittest.py", line 302, in failUnlessEqual
    raise self.failureException, \
AssertionError: u'<dl><dt>test</dt><dd><p class="line886">test </p><dl><dt>test</dt><dd><p class="line886">test </p></dd></dl></dd><dt>test</dt><dd><p class="line886">test </p></dd></dl>' != u'<dl>\n<dt>test</dt>\n<dd><p>test </p>\n<dl>\n<dt>test</dt>\n<dd><p>test </p>\n</dd>\n</dl>\n</dd>\n<dt>test</dt>\n<dd><p>test </p>\n</dd>\n</dl>'

======================================================================
FAIL: testListSuccess16 (MoinMoin._tests.test_converter_text_html_text_x_moin.ConvertBlockRepeatableTests)
----------------------------------------------------------------------
Traceback (most recent call last):
  File "/srv/moin_tw/moin--main--1.5/MoinMoin/_tests/test_converter_text_html_text_x_moin.py", line 418, in testListSuccess16
    self.do(test, output)
  File "/srv/moin_tw/moin--main--1.5/MoinMoin/_tests/test_converter_text_html_text_x_moin.py", line 85, in do
    self.failUnlessEqual(repeat, output)
  File "/usr/lib/python2.3/unittest.py", line 302, in failUnlessEqual
    raise self.failureException, \
AssertionError: u'<ul><li><p class="line886">test </p></li><li class="gap"><p class="line886">test </p></li></ul>' != u'<ul>\n<li><p>test </p>\n</li>\n</ul>\n<ol type="1">\n<li><p>test </p>\n</li>\n</ol>'

======================================================================
FAIL: testListSuccess17 (MoinMoin._tests.test_converter_text_html_text_x_moin.ConvertBlockRepeatableTests)
----------------------------------------------------------------------
Traceback (most recent call last):
  File "/srv/moin_tw/moin--main--1.5/MoinMoin/_tests/test_converter_text_html_text_x_moin.py", line 438, in testListSuccess17
    self.do(test, output)
  File "/srv/moin_tw/moin--main--1.5/MoinMoin/_tests/test_converter_text_html_text_x_moin.py", line 85, in do
    self.failUnlessEqual(repeat, output)
  File "/usr/lib/python2.3/unittest.py", line 302, in failUnlessEqual
    raise self.failureException, \
AssertionError: u'<ul><li><p class="line886">test </p></li><dt>test</dt><dd><p class="line886">test </p></dd></ul>' != u'<ul>\n<li><p>test </p>\n</li>\n</ul>\n<dl>\n<dt>test</dt>\n<dd><p>test </p>\n</dd>\n</dl>'

======================================================================
FAIL: testListSuccess18 (MoinMoin._tests.test_converter_text_html_text_x_moin.ConvertBlockRepeatableTests)
----------------------------------------------------------------------
Traceback (most recent call last):
  File "/srv/moin_tw/moin--main--1.5/MoinMoin/_tests/test_converter_text_html_text_x_moin.py", line 457, in testListSuccess18
    self.do(test, output)
  File "/srv/moin_tw/moin--main--1.5/MoinMoin/_tests/test_converter_text_html_text_x_moin.py", line 85, in do
    self.failUnlessEqual(repeat, output)
  File "/usr/lib/python2.3/unittest.py", line 302, in failUnlessEqual
    raise self.failureException, \
AssertionError: u'<ol type="1"><li><p class="line886">test </p></li><li class="gap"><p class="line886">test </p></li></ol>' != u'<ol type="1">\n<li><p>test </p>\n</li>\n</ol>\n<ul>\n<li><p>test </p>\n</li>\n</ul>'

======================================================================
FAIL: testListSuccess19 (MoinMoin._tests.test_converter_text_html_text_x_moin.ConvertBlockRepeatableTests)
----------------------------------------------------------------------
Traceback (most recent call last):
  File "/srv/moin_tw/moin--main--1.5/MoinMoin/_tests/test_converter_text_html_text_x_moin.py", line 477, in testListSuccess19
    self.do(test, output)
  File "/srv/moin_tw/moin--main--1.5/MoinMoin/_tests/test_converter_text_html_text_x_moin.py", line 85, in do
    self.failUnlessEqual(repeat, output)
  File "/usr/lib/python2.3/unittest.py", line 302, in failUnlessEqual
    raise self.failureException, \
AssertionError: u'<ol type="1"><li><p class="line886">test </p></li><dt>test</dt><dd><p class="line886">test </p></dd></ol>' != u'<ol type="1">\n<li><p>test </p>\n</li>\n</ol>\n<dl>\n<dt>test</dt>\n<dd><p>test </p>\n</dd>\n</dl>'

======================================================================
FAIL: testListSuccess20 (MoinMoin._tests.test_converter_text_html_text_x_moin.ConvertBlockRepeatableTests)
----------------------------------------------------------------------
Traceback (most recent call last):
  File "/srv/moin_tw/moin--main--1.5/MoinMoin/_tests/test_converter_text_html_text_x_moin.py", line 497, in testListSuccess20
    self.do(test, output)
  File "/srv/moin_tw/moin--main--1.5/MoinMoin/_tests/test_converter_text_html_text_x_moin.py", line 85, in do
    self.failUnlessEqual(repeat, output)
  File "/usr/lib/python2.3/unittest.py", line 302, in failUnlessEqual
    raise self.failureException, \
AssertionError: u'<dl><dt>test</dt><dd><p class="line886">test </p></dd><li class="gap"><p class="line886">test </p></li></dl>' != u'<dl>\n<dt>test</dt>\n<dd><p>test </p>\n</dd>\n</dl>\n<ul>\n<li><p>test </p>\n</li>\n</ul>'

======================================================================
FAIL: testListSuccess21 (MoinMoin._tests.test_converter_text_html_text_x_moin.ConvertBlockRepeatableTests)
----------------------------------------------------------------------
Traceback (most recent call last):
  File "/srv/moin_tw/moin--main--1.5/MoinMoin/_tests/test_converter_text_html_text_x_moin.py", line 517, in testListSuccess21
    self.do(test, output)
  File "/srv/moin_tw/moin--main--1.5/MoinMoin/_tests/test_converter_text_html_text_x_moin.py", line 85, in do
    self.failUnlessEqual(repeat, output)
  File "/usr/lib/python2.3/unittest.py", line 302, in failUnlessEqual
    raise self.failureException, \
AssertionError: u'<dl><dt>test</dt><dd><p class="line886">test </p></dd><li class="gap"><p class="line886">test </p></li></dl>' != u'<dl>\n<dt>test</dt>\n<dd><p>test </p>\n</dd>\n</dl>\n<ol type="1">\n<li><p>test </p>\n</li>\n</ol>'

======================================================================
FAIL: testListSuccess23 (MoinMoin._tests.test_converter_text_html_text_x_moin.ConvertBlockRepeatableTests)
----------------------------------------------------------------------
Traceback (most recent call last):
  File "/srv/moin_tw/moin--main--1.5/MoinMoin/_tests/test_converter_text_html_text_x_moin.py", line 535, in testListSuccess23
    self.do(test, output)
  File "/srv/moin_tw/moin--main--1.5/MoinMoin/_tests/test_converter_text_html_text_x_moin.py", line 85, in do
    self.failUnlessEqual(repeat, output)
  File "/usr/lib/python2.3/unittest.py", line 302, in failUnlessEqual
    raise self.failureException, \
AssertionError: u'<ol type="1"><li><p class="line886">test </p><ul><li><p class="line886">test </p></li></ul></ol>' != u'<ol type="1">\n<li><p>test </p>\n<ul>\n<li><p>test </p>\n</li>\n</ul>\n</li>\n</ol>'

======================================================================
FAIL: testListSuccess26 (MoinMoin._tests.test_converter_text_html_text_x_moin.ConvertBlockRepeatableTests)
----------------------------------------------------------------------
Traceback (most recent call last):
  File "/srv/moin_tw/moin--main--1.5/MoinMoin/_tests/test_converter_text_html_text_x_moin.py", line 551, in testListSuccess26
    self.do(test, output)
  File "/srv/moin_tw/moin--main--1.5/MoinMoin/_tests/test_converter_text_html_text_x_moin.py", line 85, in do
    self.failUnlessEqual(repeat, output)
  File "/usr/lib/python2.3/unittest.py", line 302, in failUnlessEqual
    raise self.failureException, \
AssertionError: u'<ul><li><p class="line886">test </p></li></ul><p class="line886">test </p>' != u'<ul>\n<li><p>test </p>\n</li>\n</ul>\n<p>test </p>'

======================================================================
FAIL: testListSuccess28 (MoinMoin._tests.test_converter_text_html_text_x_moin.ConvertBlockRepeatableTests)
----------------------------------------------------------------------
Traceback (most recent call last):
  File "/srv/moin_tw/moin--main--1.5/MoinMoin/_tests/test_converter_text_html_text_x_moin.py", line 567, in testListSuccess28
    self.do(test, output)
  File "/srv/moin_tw/moin--main--1.5/MoinMoin/_tests/test_converter_text_html_text_x_moin.py", line 85, in do
    self.failUnlessEqual(repeat, output)
  File "/usr/lib/python2.3/unittest.py", line 302, in failUnlessEqual
    raise self.failureException, \
AssertionError: u'<ul><li><p class="line886">test </p><p class="line886">test </p></li></ul>' != u'<ul>\n<li><p>test </p>\n<p>test </p>\n</li>\n</ul>'

======================================================================
FAIL: testListSuccess29 (MoinMoin._tests.test_converter_text_html_text_x_moin.ConvertBlockRepeatableTests)
----------------------------------------------------------------------
Traceback (most recent call last):
  File "/srv/moin_tw/moin--main--1.5/MoinMoin/_tests/test_converter_text_html_text_x_moin.py", line 577, in testListSuccess29
    self.do(test, output)
  File "/srv/moin_tw/moin--main--1.5/MoinMoin/_tests/test_converter_text_html_text_x_moin.py", line 85, in do
    self.failUnlessEqual(repeat, output)
  File "/usr/lib/python2.3/unittest.py", line 302, in failUnlessEqual
    raise self.failureException, \
AssertionError: u'<ul><li><p class="line886">test </p><ul><li><p class="line886">test </p></li></ul><p class="line886">test </p></li></ul>' != u''

======================================================================
FAIL: testListSuccess30 (MoinMoin._tests.test_converter_text_html_text_x_moin.ConvertBlockRepeatableTests)
----------------------------------------------------------------------
Traceback (most recent call last):
  File "/srv/moin_tw/moin--main--1.5/MoinMoin/_tests/test_converter_text_html_text_x_moin.py", line 587, in testListSuccess30
    self.do(test, output)
  File "/srv/moin_tw/moin--main--1.5/MoinMoin/_tests/test_converter_text_html_text_x_moin.py", line 85, in do
    self.failUnlessEqual(repeat, output)
  File "/usr/lib/python2.3/unittest.py", line 302, in failUnlessEqual
    raise self.failureException, \
AssertionError: u'<ul><li><p class="line886">test </p><ul><li><p class="line886">test test </p></li></ul></ul>' != u''

======================================================================
FAIL: testParagraph1 (MoinMoin._tests.test_converter_text_html_text_x_moin.ConvertBlockRepeatableTests)
----------------------------------------------------------------------
Traceback (most recent call last):
  File "/srv/moin_tw/moin--main--1.5/MoinMoin/_tests/test_converter_text_html_text_x_moin.py", line 597, in testParagraph1
    self.do(test, output)
  File "/srv/moin_tw/moin--main--1.5/MoinMoin/_tests/test_converter_text_html_text_x_moin.py", line 85, in do
    self.failUnlessEqual(repeat, output)
  File "/usr/lib/python2.3/unittest.py", line 302, in failUnlessEqual
    raise self.failureException, \
AssertionError: u'<p class="line886">test </p>' != u'<p>test </p>'

======================================================================
FAIL: testParagraph2 (MoinMoin._tests.test_converter_text_html_text_x_moin.ConvertBlockRepeatableTests)
----------------------------------------------------------------------
Traceback (most recent call last):
  File "/srv/moin_tw/moin--main--1.5/MoinMoin/_tests/test_converter_text_html_text_x_moin.py", line 610, in testParagraph2
    self.do(test, output)
  File "/srv/moin_tw/moin--main--1.5/MoinMoin/_tests/test_converter_text_html_text_x_moin.py", line 85, in do
    self.failUnlessEqual(repeat, output)
  File "/usr/lib/python2.3/unittest.py", line 302, in failUnlessEqual
    raise self.failureException, \
AssertionError: u'<p class="line886">test </p><p class="line886">test </p>' != u'<p>test </p>\n<p>test </p>'

======================================================================
FAIL: testPreSuccess1 (MoinMoin._tests.test_converter_text_html_text_x_moin.ConvertBlockRepeatableTests)
----------------------------------------------------------------------
Traceback (most recent call last):
  File "/srv/moin_tw/moin--main--1.5/MoinMoin/_tests/test_converter_text_html_text_x_moin.py", line 624, in testPreSuccess1
    self.do(test, output)
  File "/srv/moin_tw/moin--main--1.5/MoinMoin/_tests/test_converter_text_html_text_x_moin.py", line 85, in do
    self.failUnlessEqual(repeat, output)
  File "/usr/lib/python2.3/unittest.py", line 302, in failUnlessEqual
    raise self.failureException, \
AssertionError: u'<pre>test\n</pre>' != u'<pre>\ntest\n</pre>'

======================================================================
FAIL: testPreSuccess2 (MoinMoin._tests.test_converter_text_html_text_x_moin.ConvertBlockRepeatableTests)
----------------------------------------------------------------------
Traceback (most recent call last):
  File "/srv/moin_tw/moin--main--1.5/MoinMoin/_tests/test_converter_text_html_text_x_moin.py", line 640, in testPreSuccess2
    self.do(test, output)
  File "/srv/moin_tw/moin--main--1.5/MoinMoin/_tests/test_converter_text_html_text_x_moin.py", line 85, in do
    self.failUnlessEqual(repeat, output)
  File "/usr/lib/python2.3/unittest.py", line 302, in failUnlessEqual
    raise self.failureException, \
AssertionError: u'<pre>test\ntest\n</pre>' != u'<pre>\ntest\ntest\n</pre>'

======================================================================
FAIL: testPreSuccess3 (MoinMoin._tests.test_converter_text_html_text_x_moin.ConvertBlockRepeatableTests)
----------------------------------------------------------------------
Traceback (most recent call last):
  File "/srv/moin_tw/moin--main--1.5/MoinMoin/_tests/test_converter_text_html_text_x_moin.py", line 658, in testPreSuccess3
    self.do(test, output)
  File "/srv/moin_tw/moin--main--1.5/MoinMoin/_tests/test_converter_text_html_text_x_moin.py", line 85, in do
    self.failUnlessEqual(repeat, output)
  File "/usr/lib/python2.3/unittest.py", line 302, in failUnlessEqual
    raise self.failureException, \
AssertionError: u'<pre>test\n\ntest\n</pre>' != u'<pre>\ntest\n\ntest\n</pre>'

======================================================================
FAIL: testPreSuccess4 (MoinMoin._tests.test_converter_text_html_text_x_moin.ConvertBlockRepeatableTests)
----------------------------------------------------------------------
Traceback (most recent call last):
  File "/srv/moin_tw/moin--main--1.5/MoinMoin/_tests/test_converter_text_html_text_x_moin.py", line 672, in testPreSuccess4
    self.do(test, output)
  File "/srv/moin_tw/moin--main--1.5/MoinMoin/_tests/test_converter_text_html_text_x_moin.py", line 85, in do
    self.failUnlessEqual(repeat, output)
  File "/usr/lib/python2.3/unittest.py", line 302, in failUnlessEqual
    raise self.failureException, \
AssertionError: u'<pre> * test\n</pre>' != u'<pre>\n * test\n</pre>'

======================================================================
FAIL: testPreSuccess5 (MoinMoin._tests.test_converter_text_html_text_x_moin.ConvertBlockRepeatableTests)
----------------------------------------------------------------------
Traceback (most recent call last):
  File "/srv/moin_tw/moin--main--1.5/MoinMoin/_tests/test_converter_text_html_text_x_moin.py", line 684, in testPreSuccess5
    self.do(test, output)
  File "/srv/moin_tw/moin--main--1.5/MoinMoin/_tests/test_converter_text_html_text_x_moin.py", line 85, in do
    self.failUnlessEqual(repeat, output)
  File "/usr/lib/python2.3/unittest.py", line 302, in failUnlessEqual
    raise self.failureException, \
AssertionError: u'<pre>  </pre>' != u'<pre>\n  </pre>'

======================================================================
FAIL: testPreSuccess6 (MoinMoin._tests.test_converter_text_html_text_x_moin.ConvertBlockRepeatableTests)
----------------------------------------------------------------------
Traceback (most recent call last):
  File "/srv/moin_tw/moin--main--1.5/MoinMoin/_tests/test_converter_text_html_text_x_moin.py", line 702, in testPreSuccess6
    self.do(test, output)
  File "/srv/moin_tw/moin--main--1.5/MoinMoin/_tests/test_converter_text_html_text_x_moin.py", line 85, in do
    self.failUnlessEqual(repeat, output)
  File "/usr/lib/python2.3/unittest.py", line 302, in failUnlessEqual
    raise self.failureException, \
AssertionError: u'<ul><li><pre>test\n</pre></li></ul>' != u'<ul>\n<li>\n<pre>\ntest\n</pre>\n</li>\n</ul>'

======================================================================
FAIL: testPreSuccess7 (MoinMoin._tests.test_converter_text_html_text_x_moin.ConvertBlockRepeatableTests)
----------------------------------------------------------------------
Traceback (most recent call last):
  File "/srv/moin_tw/moin--main--1.5/MoinMoin/_tests/test_converter_text_html_text_x_moin.py", line 720, in testPreSuccess7
    self.do(test, output)
  File "/srv/moin_tw/moin--main--1.5/MoinMoin/_tests/test_converter_text_html_text_x_moin.py", line 85, in do
    self.failUnlessEqual(repeat, output)
  File "/usr/lib/python2.3/unittest.py", line 302, in failUnlessEqual
    raise self.failureException, \
AssertionError: u'<ul><li><pre>   test\n   </pre></li></ul>' != u'<ul>\n<li>\n<pre>\n   test\n   </pre>\n</li>\n</ul>'

======================================================================
FAIL: testPreSuccess8 (MoinMoin._tests.test_converter_text_html_text_x_moin.ConvertBlockRepeatableTests)
----------------------------------------------------------------------
Traceback (most recent call last):
  File "/srv/moin_tw/moin--main--1.5/MoinMoin/_tests/test_converter_text_html_text_x_moin.py", line 740, in testPreSuccess8
    self.do(test, output)
  File "/srv/moin_tw/moin--main--1.5/MoinMoin/_tests/test_converter_text_html_text_x_moin.py", line 85, in do
    self.failUnlessEqual(repeat, output)
  File "/usr/lib/python2.3/unittest.py", line 302, in failUnlessEqual
    raise self.failureException, \
AssertionError: u'<ul><li><p class="line886">test </p><pre>test\n</pre></li></ul>' != u'<ul>\n<li><p>test \n</p>\n<pre>\ntest\n</pre>\n</li>\n</ul>'

======================================================================
FAIL: testPreSuccess9 (MoinMoin._tests.test_converter_text_html_text_x_moin.ConvertBlockRepeatableTests)
----------------------------------------------------------------------
Traceback (most recent call last):
  File "/srv/moin_tw/moin--main--1.5/MoinMoin/_tests/test_converter_text_html_text_x_moin.py", line 761, in testPreSuccess9
    self.do(test, output)
  File "/srv/moin_tw/moin--main--1.5/MoinMoin/_tests/test_converter_text_html_text_x_moin.py", line 85, in do
    self.failUnlessEqual(repeat, output)
  File "/usr/lib/python2.3/unittest.py", line 302, in failUnlessEqual
    raise self.failureException, \
AssertionError: u'<ul><li><p class="line886">test </p></li></ul><pre>test\n</pre>' != u'<ul>\n<li><p>test </p>\n</li>\n</ul>\n\n<pre>\ntest\n</pre>'

======================================================================
FAIL: testRule1 (MoinMoin._tests.test_converter_text_html_text_x_moin.ConvertBlockRepeatableTests)
----------------------------------------------------------------------
Traceback (most recent call last):
  File "/srv/moin_tw/moin--main--1.5/MoinMoin/_tests/test_converter_text_html_text_x_moin.py", line 771, in testRule1
    self.do(test, output)
  File "/srv/moin_tw/moin--main--1.5/MoinMoin/_tests/test_converter_text_html_text_x_moin.py", line 85, in do
    self.failUnlessEqual(repeat, output)
  File "/usr/lib/python2.3/unittest.py", line 302, in failUnlessEqual
    raise self.failureException, \
AssertionError: u'<hr /><p class="line886"> </p>' != u'<hr/>'

======================================================================
FAIL: testTable01 (MoinMoin._tests.test_converter_text_html_text_x_moin.ConvertBlockRepeatableTests)
----------------------------------------------------------------------
Traceback (most recent call last):
  File "/srv/moin_tw/moin--main--1.5/MoinMoin/_tests/test_converter_text_html_text_x_moin.py", line 789, in testTable01
    self.do(test, output)
  File "/srv/moin_tw/moin--main--1.5/MoinMoin/_tests/test_converter_text_html_text_x_moin.py", line 85, in do
    self.failUnlessEqual(repeat, output)
  File "/usr/lib/python2.3/unittest.py", line 302, in failUnlessEqual
    raise self.failureException, \
AssertionError: u'<table><tr>  <td><p class="line879"> </p></td>\n</tr>\n</table>' != u'<div>\n<table>\n<tr>\n<td>\n<p> </p>\n</td>\n</tr>\n</table>\n</div>'

======================================================================
FAIL: testTable02 (MoinMoin._tests.test_converter_text_html_text_x_moin.ConvertBlockRepeatableTests)
----------------------------------------------------------------------
Traceback (most recent call last):
  File "/srv/moin_tw/moin--main--1.5/MoinMoin/_tests/test_converter_text_html_text_x_moin.py", line 807, in testTable02
    self.do(test, output)
  File "/srv/moin_tw/moin--main--1.5/MoinMoin/_tests/test_converter_text_html_text_x_moin.py", line 85, in do
    self.failUnlessEqual(repeat, output)
  File "/usr/lib/python2.3/unittest.py", line 302, in failUnlessEqual
    raise self.failureException, \
AssertionError: u'<table><tr>  <td><p class="line879">test</p></td>\n</tr>\n</table>' != u'<div>\n<table>\n<tr>\n<td>\n<p>test</p>\n</td>\n</tr>\n</table>\n</div>'

======================================================================
FAIL: testTable03 (MoinMoin._tests.test_converter_text_html_text_x_moin.ConvertBlockRepeatableTests)
----------------------------------------------------------------------
Traceback (most recent call last):
  File "/srv/moin_tw/moin--main--1.5/MoinMoin/_tests/test_converter_text_html_text_x_moin.py", line 828, in testTable03
    self.do(test, output)
  File "/srv/moin_tw/moin--main--1.5/MoinMoin/_tests/test_converter_text_html_text_x_moin.py", line 85, in do
    self.failUnlessEqual(repeat, output)
  File "/usr/lib/python2.3/unittest.py", line 302, in failUnlessEqual
    raise self.failureException, \
AssertionError: u'<table><tr>  <td><p class="line879">test</p></td>\n  <td><p class="line879">test</p></td>\n</tr>\n</table>' != u'<div>\n<table>\n<tr>\n<td>\n<p>test</p>\n</td>\n<td>\n<p>test</p>\n</td>\n</tr>\n</table>\n</div>'

======================================================================
FAIL: testTable04 (MoinMoin._tests.test_converter_text_html_text_x_moin.ConvertBlockRepeatableTests)
----------------------------------------------------------------------
Traceback (most recent call last):
  File "/srv/moin_tw/moin--main--1.5/MoinMoin/_tests/test_converter_text_html_text_x_moin.py", line 855, in testTable04
    self.do(test, output)
  File "/srv/moin_tw/moin--main--1.5/MoinMoin/_tests/test_converter_text_html_text_x_moin.py", line 85, in do
    self.failUnlessEqual(repeat, output)
  File "/usr/lib/python2.3/unittest.py", line 302, in failUnlessEqual
    raise self.failureException, \
AssertionError: u'<table><tr>  <td><p class="line879">test</p></td>\n</tr>\n<tr>  <td><p class="line879">test</p></td>\n  <td><p class="line879">test</p></td>\n</tr>\n</table>' != u'<div>\n<table>\n<tr>\n<td>\n<p>test</p>\n</td>\n</tr>\n<tr>\n<td>\n<p>test</p>\n</td>\n<td>\n<p>test</p>\n</td>\n</tr>\n</table>\n</div>'

======================================================================
FAIL: testTable05 (MoinMoin._tests.test_converter_text_html_text_x_moin.ConvertBlockRepeatableTests)
----------------------------------------------------------------------
Traceback (most recent call last):
  File "/srv/moin_tw/moin--main--1.5/MoinMoin/_tests/test_converter_text_html_text_x_moin.py", line 882, in testTable05
    self.do(test, output)
  File "/srv/moin_tw/moin--main--1.5/MoinMoin/_tests/test_converter_text_html_text_x_moin.py", line 85, in do
    self.failUnlessEqual(repeat, output)
  File "/usr/lib/python2.3/unittest.py", line 302, in failUnlessEqual
    raise self.failureException, \
AssertionError: u'<table><tr>  <td colspan="2" style="text-align:center;"><p class="line879">test</p></td>\n</tr>\n<tr>  <td><p class="line879">test</p></td>\n  <td><p class="line879">test</p></td>\n</tr>\n</table>' != u'<div>\n<table>\n<tr>\n<td colspan="2" style="text-align: center;">\n<p>test</p>\n</td>\n</tr>\n<tr>\n<td>\n<p>test</p>\n</td>\n<td>\n<p>test</p>\n</td>\n</tr>\n</table>\n</div>'

======================================================================
FAIL: testTable06 (MoinMoin._tests.test_converter_text_html_text_x_moin.ConvertBlockRepeatableTests)
----------------------------------------------------------------------
Traceback (most recent call last):
  File "/srv/moin_tw/moin--main--1.5/MoinMoin/_tests/test_converter_text_html_text_x_moin.py", line 912, in testTable06
    self.do(test, output)
  File "/srv/moin_tw/moin--main--1.5/MoinMoin/_tests/test_converter_text_html_text_x_moin.py", line 85, in do
    self.failUnlessEqual(repeat, output)
  File "/usr/lib/python2.3/unittest.py", line 302, in failUnlessEqual
    raise self.failureException, \
AssertionError: u'<table><tr>  <td colspan="2" style="text-align:center;"><p class="line879">test</p></td>\n  <td><p class="line879">test</p></td>\n</tr>\n<tr>  <td><p class="line879">test</p></td>\n  <td colspan="2" style="text-align:center;"><p class="line879">test</p></td>\n</tr>\n</table>' != u'<div>\n<table>\n<tr>\n<td colspan="2" style="text-align: center;">\n<p>test</p>\n</td>\n<td>\n<p>test</p>\n</td>\n</tr>\n<tr>\n<td>\n<p>test</p>\n</td>\n<td colspan="2" style="text-align: center;">\n<p>test</p>\n</td>\n</tr>\n</table>\n</div>'

======================================================================
FAIL: testEmphasis01 (MoinMoin._tests.test_converter_text_html_text_x_moin.ConvertInlineFormatRepeatableTests)
----------------------------------------------------------------------
Traceback (most recent call last):
  File "/srv/moin_tw/moin--main--1.5/MoinMoin/_tests/test_converter_text_html_text_x_moin.py", line 933, in testEmphasis01
    self.do(test, output)
  File "/srv/moin_tw/moin--main--1.5/MoinMoin/_tests/test_converter_text_html_text_x_moin.py", line 925, in do
    self.failUnlessEqual(repeat, output)
  File "/usr/lib/python2.3/unittest.py", line 302, in failUnlessEqual
    raise self.failureException, \
AssertionError: u'<p class="line903"><i>test</i> </p>' != u'<p><em>test</em> </p>'

======================================================================
FAIL: testEmphasis02 (MoinMoin._tests.test_converter_text_html_text_x_moin.ConvertInlineFormatRepeatableTests)
----------------------------------------------------------------------
Traceback (most recent call last):
  File "/srv/moin_tw/moin--main--1.5/MoinMoin/_tests/test_converter_text_html_text_x_moin.py", line 938, in testEmphasis02
    self.do(test, output)
  File "/srv/moin_tw/moin--main--1.5/MoinMoin/_tests/test_converter_text_html_text_x_moin.py", line 925, in do
    self.failUnlessEqual(repeat, output)
  File "/usr/lib/python2.3/unittest.py", line 302, in failUnlessEqual
    raise self.failureException, \
AssertionError: u'<p class="line903"><b>test</b> </p>' != u'<p><strong>test</strong> </p>'

======================================================================
FAIL: testEmphasis03 (MoinMoin._tests.test_converter_text_html_text_x_moin.ConvertInlineFormatRepeatableTests)
----------------------------------------------------------------------
Traceback (most recent call last):
  File "/srv/moin_tw/moin--main--1.5/MoinMoin/_tests/test_converter_text_html_text_x_moin.py", line 943, in testEmphasis03
    self.do(test, output)
  File "/srv/moin_tw/moin--main--1.5/MoinMoin/_tests/test_converter_text_html_text_x_moin.py", line 925, in do
    self.failUnlessEqual(repeat, output)
  File "/usr/lib/python2.3/unittest.py", line 302, in failUnlessEqual
    raise self.failureException, \
AssertionError: u'<p class="line903"><i><b>test</b></i> </p>' != u'<p><em><strong>test</strong></em> </p>'

======================================================================
FAIL: testEmphasis04 (MoinMoin._tests.test_converter_text_html_text_x_moin.ConvertInlineFormatRepeatableTests)
----------------------------------------------------------------------
Traceback (most recent call last):
  File "/srv/moin_tw/moin--main--1.5/MoinMoin/_tests/test_converter_text_html_text_x_moin.py", line 948, in testEmphasis04
    self.do(test, output)
  File "/srv/moin_tw/moin--main--1.5/MoinMoin/_tests/test_converter_text_html_text_x_moin.py", line 925, in do
    self.failUnlessEqual(repeat, output)
  File "/usr/lib/python2.3/unittest.py", line 302, in failUnlessEqual
    raise self.failureException, \
AssertionError: u'<p class="line903"><i>test<b>test</b></i> </p>' != u'<p><em>test<strong>test</strong></em> </p>'

======================================================================
FAIL: testEmphasis05 (MoinMoin._tests.test_converter_text_html_text_x_moin.ConvertInlineFormatRepeatableTests)
----------------------------------------------------------------------
Traceback (most recent call last):
  File "/srv/moin_tw/moin--main--1.5/MoinMoin/_tests/test_converter_text_html_text_x_moin.py", line 953, in testEmphasis05
    self.do(test, output)
  File "/srv/moin_tw/moin--main--1.5/MoinMoin/_tests/test_converter_text_html_text_x_moin.py", line 925, in do
    self.failUnlessEqual(repeat, output)
  File "/usr/lib/python2.3/unittest.py", line 302, in failUnlessEqual
    raise self.failureException, \
AssertionError: u'<p class="line903"><b>test<i>test</i></b> </p>' != u'<p><strong>test<em>test</em></strong> </p>'

======================================================================
FAIL: testEmphasis06 (MoinMoin._tests.test_converter_text_html_text_x_moin.ConvertInlineFormatRepeatableTests)
----------------------------------------------------------------------
Traceback (most recent call last):
  File "/srv/moin_tw/moin--main--1.5/MoinMoin/_tests/test_converter_text_html_text_x_moin.py", line 958, in testEmphasis06
    self.do(test, output)
  File "/srv/moin_tw/moin--main--1.5/MoinMoin/_tests/test_converter_text_html_text_x_moin.py", line 925, in do
    self.failUnlessEqual(repeat, output)
  File "/usr/lib/python2.3/unittest.py", line 302, in failUnlessEqual
    raise self.failureException, \
AssertionError: u'<p class="line903"><i>test<b>test</b>test</i> </p>' != u'<p><em>test<strong>test</strong>test</em> </p>'

======================================================================
FAIL: testEmphasis07 (MoinMoin._tests.test_converter_text_html_text_x_moin.ConvertInlineFormatRepeatableTests)
----------------------------------------------------------------------
Traceback (most recent call last):
  File "/srv/moin_tw/moin--main--1.5/MoinMoin/_tests/test_converter_text_html_text_x_moin.py", line 963, in testEmphasis07
    self.do(test, output)
  File "/srv/moin_tw/moin--main--1.5/MoinMoin/_tests/test_converter_text_html_text_x_moin.py", line 925, in do
    self.failUnlessEqual(repeat, output)
  File "/usr/lib/python2.3/unittest.py", line 302, in failUnlessEqual
    raise self.failureException, \
AssertionError: u'<p class="line903"><b>test<i>test</i>test</b> </p>' != u'<p><strong>test<em>test</em>test</strong> </p>'

======================================================================
FAIL: testEmphasis08 (MoinMoin._tests.test_converter_text_html_text_x_moin.ConvertInlineFormatRepeatableTests)
----------------------------------------------------------------------
Traceback (most recent call last):
  File "/srv/moin_tw/moin--main--1.5/MoinMoin/_tests/test_converter_text_html_text_x_moin.py", line 968, in testEmphasis08
    self.do(test, output)
  File "/srv/moin_tw/moin--main--1.5/MoinMoin/_tests/test_converter_text_html_text_x_moin.py", line 925, in do
    self.failUnlessEqual(repeat, output)
  File "/usr/lib/python2.3/unittest.py", line 302, in failUnlessEqual
    raise self.failureException, \
AssertionError: u'<p class="line903"><i>test</i><b>test</b> </p>' != u'<p><em>test</em><strong>test</strong> </p>'

======================================================================
FAIL: testEmphasis09 (MoinMoin._tests.test_converter_text_html_text_x_moin.ConvertInlineFormatRepeatableTests)
----------------------------------------------------------------------
Traceback (most recent call last):
  File "/srv/moin_tw/moin--main--1.5/MoinMoin/_tests/test_converter_text_html_text_x_moin.py", line 973, in testEmphasis09
    self.do(test, output)
  File "/srv/moin_tw/moin--main--1.5/MoinMoin/_tests/test_converter_text_html_text_x_moin.py", line 925, in do
    self.failUnlessEqual(repeat, output)
  File "/usr/lib/python2.3/unittest.py", line 302, in failUnlessEqual
    raise self.failureException, \
AssertionError: u'<p class="line903"><b>test</b><i>test</i> </p>' != u'<p><strong>test</strong><em>test</em> </p>'

======================================================================
FAIL: testEmphasis10 (MoinMoin._tests.test_converter_text_html_text_x_moin.ConvertInlineFormatRepeatableTests)
----------------------------------------------------------------------
Traceback (most recent call last):
  File "/srv/moin_tw/moin--main--1.5/MoinMoin/_tests/test_converter_text_html_text_x_moin.py", line 978, in testEmphasis10
    self.do(test, output)
  File "/srv/moin_tw/moin--main--1.5/MoinMoin/_tests/test_converter_text_html_text_x_moin.py", line 925, in do
    self.failUnlessEqual(repeat, output)
  File "/usr/lib/python2.3/unittest.py", line 302, in failUnlessEqual
    raise self.failureException, \
AssertionError: u'<p class="line903"><b><i>test</i>test</b> </p>' != u'<p><strong><em>test</em>test</strong> </p>'

======================================================================
FAIL: testEmphasis11 (MoinMoin._tests.test_converter_text_html_text_x_moin.ConvertInlineFormatRepeatableTests)
----------------------------------------------------------------------
Traceback (most recent call last):
  File "/srv/moin_tw/moin--main--1.5/MoinMoin/_tests/test_converter_text_html_text_x_moin.py", line 983, in testEmphasis11
    self.do(test, output)
  File "/srv/moin_tw/moin--main--1.5/MoinMoin/_tests/test_converter_text_html_text_x_moin.py", line 925, in do
    self.failUnlessEqual(repeat, output)
  File "/usr/lib/python2.3/unittest.py", line 302, in failUnlessEqual
    raise self.failureException, \
AssertionError: u'<p class="line903"><i><b>test</b>test</i> </p>' != u'<p><em><strong>test</strong>test</em> </p>'

======================================================================
FAIL: testFormatBig01 (MoinMoin._tests.test_converter_text_html_text_x_moin.ConvertInlineFormatRepeatableTests)
----------------------------------------------------------------------
Traceback (most recent call last):
  File "/srv/moin_tw/moin--main--1.5/MoinMoin/_tests/test_converter_text_html_text_x_moin.py", line 988, in testFormatBig01
    self.do(test, output)
  File "/srv/moin_tw/moin--main--1.5/MoinMoin/_tests/test_converter_text_html_text_x_moin.py", line 925, in do
    self.failUnlessEqual(repeat, output)
  File "/usr/lib/python2.3/unittest.py", line 302, in failUnlessEqual
    raise self.failureException, \
AssertionError: u'<p class="line903"><big>test</big> </p>' != u'<p><big>test</big> </p>'

======================================================================
FAIL: testFormatSmall01 (MoinMoin._tests.test_converter_text_html_text_x_moin.ConvertInlineFormatRepeatableTests)
----------------------------------------------------------------------
Traceback (most recent call last):
  File "/srv/moin_tw/moin--main--1.5/MoinMoin/_tests/test_converter_text_html_text_x_moin.py", line 993, in testFormatSmall01
    self.do(test, output)
  File "/srv/moin_tw/moin--main--1.5/MoinMoin/_tests/test_converter_text_html_text_x_moin.py", line 925, in do
    self.failUnlessEqual(repeat, output)
  File "/usr/lib/python2.3/unittest.py", line 302, in failUnlessEqual
    raise self.failureException, \
AssertionError: u'<p class="line903"><small>test</small> </p>' != u'<p><small>test</small> </p>'

======================================================================
FAIL: testFormatStrike01 (MoinMoin._tests.test_converter_text_html_text_x_moin.ConvertInlineFormatRepeatableTests)
----------------------------------------------------------------------
Traceback (most recent call last):
  File "/srv/moin_tw/moin--main--1.5/MoinMoin/_tests/test_converter_text_html_text_x_moin.py", line 998, in testFormatStrike01
    self.do(test, output)
  File "/srv/moin_tw/moin--main--1.5/MoinMoin/_tests/test_converter_text_html_text_x_moin.py", line 925, in do
    self.failUnlessEqual(repeat, output)
  File "/usr/lib/python2.3/unittest.py", line 302, in failUnlessEqual
    raise self.failureException, \
AssertionError: u'<p class="line903"><span class="strike">test</span> </p>' != u'<p><strike>test</strike> </p>'

======================================================================
FAIL: testFormatSub01 (MoinMoin._tests.test_converter_text_html_text_x_moin.ConvertInlineFormatRepeatableTests)
----------------------------------------------------------------------
Traceback (most recent call last):
  File "/srv/moin_tw/moin--main--1.5/MoinMoin/_tests/test_converter_text_html_text_x_moin.py", line 1003, in testFormatSub01
    self.do(test, output)
  File "/srv/moin_tw/moin--main--1.5/MoinMoin/_tests/test_converter_text_html_text_x_moin.py", line 925, in do
    self.failUnlessEqual(repeat, output)
  File "/usr/lib/python2.3/unittest.py", line 302, in failUnlessEqual
    raise self.failureException, \
AssertionError: u'<p class="line903"><sub>test</sub> </p>' != u'<p><sub>test</sub> </p>'

======================================================================
FAIL: testFormatSup01 (MoinMoin._tests.test_converter_text_html_text_x_moin.ConvertInlineFormatRepeatableTests)
----------------------------------------------------------------------
Traceback (most recent call last):
  File "/srv/moin_tw/moin--main--1.5/MoinMoin/_tests/test_converter_text_html_text_x_moin.py", line 1008, in testFormatSup01
    self.do(test, output)
  File "/srv/moin_tw/moin--main--1.5/MoinMoin/_tests/test_converter_text_html_text_x_moin.py", line 925, in do
    self.failUnlessEqual(repeat, output)
  File "/usr/lib/python2.3/unittest.py", line 302, in failUnlessEqual
    raise self.failureException, \
AssertionError: u'<p class="line903"><sup>test</sup> </p>' != u'<p><sup>test</sup> </p>'

======================================================================
FAIL: testFormatUnderline01 (MoinMoin._tests.test_converter_text_html_text_x_moin.ConvertInlineFormatRepeatableTests)
----------------------------------------------------------------------
Traceback (most recent call last):
  File "/srv/moin_tw/moin--main--1.5/MoinMoin/_tests/test_converter_text_html_text_x_moin.py", line 1013, in testFormatUnderline01
    self.do(test, output)
  File "/srv/moin_tw/moin--main--1.5/MoinMoin/_tests/test_converter_text_html_text_x_moin.py", line 925, in do
    self.failUnlessEqual(repeat, output)
  File "/usr/lib/python2.3/unittest.py", line 302, in failUnlessEqual
    raise self.failureException, \
AssertionError: u'<p class="line903"><u>test</u> </p>' != u'<p><u>test</u> </p>'

======================================================================
FAIL: testPre01 (MoinMoin._tests.test_converter_text_html_text_x_moin.ConvertInlineFormatRepeatableTests)
----------------------------------------------------------------------
Traceback (most recent call last):
  File "/srv/moin_tw/moin--main--1.5/MoinMoin/_tests/test_converter_text_html_text_x_moin.py", line 1018, in testPre01
    self.do(test, output)
  File "/srv/moin_tw/moin--main--1.5/MoinMoin/_tests/test_converter_text_html_text_x_moin.py", line 925, in do
    self.failUnlessEqual(repeat, output)
  File "/usr/lib/python2.3/unittest.py", line 302, in failUnlessEqual
    raise self.failureException, \
AssertionError: u'<p class="line903"><tt>test</tt> </p>' != u'<p><tt>test</tt> </p>'

======================================================================
FAIL: testWhitespace01 (MoinMoin._tests.test_converter_text_html_text_x_moin.ConvertInlineFormatRepeatableTests)
----------------------------------------------------------------------
Traceback (most recent call last):
  File "/srv/moin_tw/moin--main--1.5/MoinMoin/_tests/test_converter_text_html_text_x_moin.py", line 1023, in testWhitespace01
    self.do(test, output)
  File "/srv/moin_tw/moin--main--1.5/MoinMoin/_tests/test_converter_text_html_text_x_moin.py", line 925, in do
    self.failUnlessEqual(repeat, output)
  File "/usr/lib/python2.3/unittest.py", line 302, in failUnlessEqual
    raise self.failureException, \
AssertionError: u'<p class="line903"><i>test <b>test</b></i> </p>' != u'<p><em>test <strong>test</strong></em> </p>'

======================================================================
FAIL: testNoWikiWord01 (MoinMoin._tests.test_converter_text_html_text_x_moin.ConvertInlineItemRepeatableTests)
----------------------------------------------------------------------
Traceback (most recent call last):
  File "/srv/moin_tw/moin--main--1.5/MoinMoin/_tests/test_converter_text_html_text_x_moin.py", line 1049, in testNoWikiWord01
    self.do(test, output)
  File "/srv/moin_tw/moin--main--1.5/MoinMoin/_tests/test_converter_text_html_text_x_moin.py", line 1036, in do
    self.failUnlessEqual(repeat, output)
  File "/usr/lib/python2.3/unittest.py", line 302, in failUnlessEqual
    raise self.failureException, \
AssertionError: u'<p class="line903"><span style="background-color:#ffff11">!</span>WikiWord </p>' != u'<p>WikiWord </p>'

======================================================================
FAIL: testSmiley01 (MoinMoin._tests.test_converter_text_html_text_x_moin.ConvertInlineItemRepeatableTests)
----------------------------------------------------------------------
Traceback (most recent call last):
  File "/srv/moin_tw/moin--main--1.5/MoinMoin/_tests/test_converter_text_html_text_x_moin.py", line 1054, in testSmiley01
    self.do(test, output)
  File "/srv/moin_tw/moin--main--1.5/MoinMoin/_tests/test_converter_text_html_text_x_moin.py", line 1036, in do
    self.failUnlessEqual(repeat, output)
  File "/usr/lib/python2.3/unittest.py", line 302, in failUnlessEqual
    raise self.failureException, \
AssertionError: u'<p class="line903"><img alt=":-)" height="15" src="/wiki/modern/img/smile.png" title=":-)" width="15" /> </p>' != u'<p><img src="/wiki/modern/img/smile.png" alt=":-)" height="15" width="15"> </p>'

======================================================================
FAIL: testWikiWord01 (MoinMoin._tests.test_converter_text_html_text_x_moin.ConvertInlineItemRepeatableTests)
----------------------------------------------------------------------
Traceback (most recent call last):
  File "/srv/moin_tw/moin--main--1.5/MoinMoin/_tests/test_converter_text_html_text_x_moin.py", line 1044, in testWikiWord01
    self.do(test, output)
  File "/srv/moin_tw/moin--main--1.5/MoinMoin/_tests/test_converter_text_html_text_x_moin.py", line 1036, in do
    self.failUnlessEqual(repeat, output)
  File "/usr/lib/python2.3/unittest.py", line 302, in failUnlessEqual
    raise self.failureException, \
AssertionError: u'<p class="line903"><a class="nonexistent nonexistent" href="./WikiWord">WikiWord</a> </p>' != u'<p><a class="nonexistent" href="./WikiWord">WikiWord</a> </p>'

======================================================================
FAIL: parser.wiki: empty lines before block element ignored
----------------------------------------------------------------------
Traceback (most recent call last):
  File "/srv/moin_tw/moin--main--1.5/MoinMoin/_tests/test_parser_wiki.py", line 450, in testEmptyLineBeforeBlock
    'Expected "%(expected)s" but got "%(result)s"' % locals())
  File "/usr/lib/python2.3/unittest.py", line 278, in failUnless
    if not expr: raise self.failureException, msg
AssertionError: Expected "<p>XXX\s*</p>\n+<hr" but got "<span class="anchor" id="line-1"></span><p class="line886">XXX <span class="anchor" id="line-2"></span></p><span class="anchor" id="line-3"></span><hr /><p class="line886"> <span class="anchor" id="line-4"></span></p><span class="anchor" id="line-5"></span>"

======================================================================
FAIL: parser.wiki: paragraph closed before block element
----------------------------------------------------------------------
Traceback (most recent call last):
  File "/srv/moin_tw/moin--main--1.5/MoinMoin/_tests/test_parser_wiki.py", line 429, in testParagraphBeforeBlock
    'Expected "%(expected)s" but got "%(result)s"' % locals())
  File "/usr/lib/python2.3/unittest.py", line 278, in failUnless
    if not expr: raise self.failureException, msg
AssertionError: Expected "<p>XXX\s*</p>\n+<hr" but got "<span class="anchor" id="line-1"></span><p class="line886">XXX <span class="anchor" id="line-2"></span></p><hr /><p class="line886"> <span class="anchor" id="line-3"></span></p><span class="anchor" id="line-4"></span>"

======================================================================
FAIL: parser.wiki: close open inline tag when block close
----------------------------------------------------------------------
Traceback (most recent call last):
  File "/srv/moin_tw/moin--main--1.5/MoinMoin/_tests/test_parser_wiki.py", line 243, in testCloseOneInline
    'Expected "%(expected)s" but got "%(result)s"' % locals())
  File "/usr/lib/python2.3/unittest.py", line 278, in failUnless
    if not expr: raise self.failureException, msg
AssertionError: Expected "<p>text<strong>text\s*</strong></p>" but got "<span class="anchor" id="line-1"></span><p class="line879">text<strong>text <span class="anchor" id="line-2"></span></strong></p>"

======================================================================
FAIL: parser.wiki: ignore white space around heading text
----------------------------------------------------------------------
Traceback (most recent call last):
  File "/srv/moin_tw/moin--main--1.5/MoinMoin/_tests/test_parser_wiki.py", line 117, in testIgnoreWhiteSpaceAroundHeadingText
    'Expected "%(expected)s" but got "%(result)s"' % locals())
  File "/usr/lib/python2.3/unittest.py", line 302, in failUnlessEqual
    raise self.failureException, \
AssertionError: Expected "<span class="anchor" id="line-1"></span>
<h1 id="head-c5ebc9c33963f7fc8730f19ee235cb34a6daa3a0">head</h1>
" but got "<span class="anchor" id="line-1"></span>
<h1 id="head-c5ebc9c33963f7fc8730f19ee235cb34a6daa3a0">head</h1>
<span class="anchor" id="line-2"></span>"

======================================================================
FAIL: parser.wiki: empty line separates paragraphs
----------------------------------------------------------------------
Traceback (most recent call last):
  File "/srv/moin_tw/moin--main--1.5/MoinMoin/_tests/test_parser_wiki.py", line 66, in testEmptyLineBetweenParagraphs
    '"%s" not in "%s"' % (expected.pattern, result))
  File "/usr/lib/python2.3/unittest.py", line 278, in failUnless
    if not expr: raise self.failureException, msg
AssertionError: "<p>\s*Second\s*</p>" not in "<span class="anchor" id="line-1"></span><p class="line886">First <span class="anchor" id="line-2"></span></p><span class="anchor" id="line-3"></span><p class="line886">Second </p>"

======================================================================
FAIL: parser.wiki: first paragraph should be in <p>
----------------------------------------------------------------------
Traceback (most recent call last):
  File "/srv/moin_tw/moin--main--1.5/MoinMoin/_tests/test_parser_wiki.py", line 59, in testFirstParagraph
    '"%s" not in "%s"' % (expected.pattern, result))
  File "/usr/lib/python2.3/unittest.py", line 278, in failUnless
    if not expr: raise self.failureException, msg
AssertionError: "<p>\s*First\s*</p>" not in "<span class="anchor" id="line-1"></span><p class="line886">First </p>"

======================================================================
FAIL: parser.wiki: ------------ long rule shortened to hr6
----------------------------------------------------------------------
Traceback (most recent call last):
  File "/srv/moin_tw/moin--main--1.5/MoinMoin/_tests/test_parser_wiki.py", line 401, in testLongRule
    'Expected "%(expected)s" but got "%(result)s"' % locals())
  File "/usr/lib/python2.3/unittest.py", line 278, in failUnless
    if not expr: raise self.failureException, msg
AssertionError: Expected "<hr class="hr6">" but got "<span class="anchor" id="line-1"></span><hr class="hr6" /><p class="line886"> </p>"

======================================================================
FAIL: parser.wiki: ---- is standard rule
----------------------------------------------------------------------
Traceback (most recent call last):
  File "/srv/moin_tw/moin--main--1.5/MoinMoin/_tests/test_parser_wiki.py", line 383, in testStandardRule
    'Expected "%(expected)s" but got "%(result)s"' % locals())
  File "/usr/lib/python2.3/unittest.py", line 278, in failUnless
    if not expr: raise self.failureException, msg
AssertionError: Expected "<hr>" but got "<span class="anchor" id="line-1"></span><hr /><p class="line886"> </p>"

======================================================================
FAIL: parser.wiki: ----- rules with size
----------------------------------------------------------------------
Traceback (most recent call last):
  File "/srv/moin_tw/moin--main--1.5/MoinMoin/_tests/test_parser_wiki.py", line 393, in testVariableRule
    'Expected "%(expected)s" but got "%(result)s"' % locals())
  File "/usr/lib/python2.3/unittest.py", line 278, in failUnless
    if not expr: raise self.failureException, msg
AssertionError: Expected "<hr class="hr1">" but got "<span class="anchor" id="line-1"></span><hr class="hr1" /><p class="line886"> </p>"

======================================================================
FAIL: util.web: creating html select with non existing selection
----------------------------------------------------------------------
Traceback (most recent call last):
  File "/srv/moin_tw/moin--main--1.5/MoinMoin/_tests/test_util_web.py", line 87, in testMakeSelectNoSelection
    'Expected "%(expected)s" but got "%(result)s"' % locals())
  File "/usr/lib/python2.3/unittest.py", line 302, in failUnlessEqual
    raise self.failureException, \
AssertionError: Expected "<select name="test"><option value="one">one</option><option value="two">two</option><option value="simple">simple</option><option value="complex">A tuple &amp; &lt;escaped text&gt;</option></select>" but got "<select name="test" size="1"><option value="one">one</option><option value="two">two</option><option value="simple">simple</option><option value="complex">A tuple &amp; &lt;escaped text&gt;</option></select>"

======================================================================
FAIL: util.web: creating html select with selected item
----------------------------------------------------------------------
Traceback (most recent call last):
  File "/srv/moin_tw/moin--main--1.5/MoinMoin/_tests/test_util_web.py", line 94, in testMakeSelectWithSelectedItem
    'Expected "%(expected)s" but got "%(result)s"' % locals())
  File "/usr/lib/python2.3/unittest.py", line 302, in failUnlessEqual
    raise self.failureException, \
AssertionError: Expected "<select name="test"><option value="one">one</option><option selected value="two">two</option><option value="simple">simple</option><option value="complex">A tuple &amp; &lt;escaped text&gt;</option></select>" but got "<select name="test" size="1"><option value="one">one</option><option selected value="two">two</option><option value="simple">simple</option><option value="complex">A tuple &amp; &lt;escaped text&gt;</option></select>"

======================================================================
FAIL: wikiutil: good system page names accepted, bad rejected
----------------------------------------------------------------------
Traceback (most recent call last):
  File "/srv/moin_tw/moin--main--1.5/MoinMoin/_tests/test_wikiutil.py", line 34, in testSystemPage
    '"%(name)s" is NOT a system page' % locals())
  File "/usr/lib/python2.3/unittest.py", line 274, in failIf
    if expr: raise self.failureException, msg
AssertionError: "FrontPage" is NOT a system page

----------------------------------------------------------------------
Ran 201 tests in 9.665s

FAILED (failures=82, errors=5)